Open main menu

Sugar Labs β

Talk:Design Team/Proposals/Touchscreen/On-screen Keyboard

< Talk:Design Team/Proposals‎ | Touchscreen
Revision as of 05:39, 20 April 2012 by Erikos (talk | contribs) (Created page with "Build error for (arm-koji build --scratch f17 maliit-framework-0.91.0-9.1.src.rpm): ude/QtCore -I/usr/include/QtGui -I/usr/include/QtTest -I/usr/include -I. -I../.. -I../../s...")
(diff) ← Older revision | Latest revision (diff) | Newer revision → (diff)

Build error for (arm-koji build --scratch f17 maliit-framework-0.91.0-9.1.src.rpm):

ude/QtCore -I/usr/include/QtGui -I/usr/include/QtTest -I/usr/include -I. -I../.. -I../../src -I../../common -I../../connection -I../utils -I/usr/X11R6/include -I.moc -o .obj/core-utils.o ../utils/core-utils.cpp /usr/lib/qt4/bin/moc -DM_IM_PLUGINS_DIR=\"/usr/lib/maliit/plugins-0.80\" -DM_IM_PLUGINS_DATA_DIR=\"/usr/share/maliit/plugins\" -DM_IM_FACTORY_PLUGINS_DIR=\"/usr/lib/maliit/plugins-0.80/factories\" -DMALIIT_EXTENSIONS_DIR=\"/usr/share/maliit-framework-1.0/extensions/\" -DMALIIT_TEST_PLUGINS_DIR=\"/usr/lib/maliit-framework-tests/plugins\" -DMALIIT_CONFIG_ROOT=\"/maliit/\" -DMALIIT_FRAMEWORK_USE_INTERNAL_API -DMALIIT_TEST_DATA_PATH=\"/usr/lib/maliit-framework-tests\" -DQT_NO_KEYWORDS -DQT_TESTLIB_LIB -DQT_GUI_LIB -DQT_CORE_LIB -DQT_SHARED -I/usr/lib/qt4/mkspecs/linux-g++ -I. -I/usr/include/QtCore -I/usr/include/QtGui -I/usr/include/QtTest -I/usr/include -I. -I../.. -I../../src -I../../common -I../../connection -I../utils -I/usr/X11R6/include -I.moc ut_maliit_inputmethod.cpp -o .moc/ut_maliit_inputmethod.moc g++ -c -pipe -g -Werror -O0 -Wall -W -D_REENTRANT -DM_IM_PLUGINS_DIR=\"/usr/lib/maliit/plugins-0.80\" -DM_IM_PLUGINS_DATA_DIR=\"/usr/share/maliit/plugins\" -DM_IM_FACTORY_PLUGINS_DIR=\"/usr/lib/maliit/plugins-0.80/factories\" -DMALIIT_EXTENSIONS_DIR=\"/usr/share/maliit-framework-1.0/extensions/\" -DMALIIT_TEST_PLUGINS_DIR=\"/usr/lib/maliit-framework-tests/plugins\" -DMALIIT_CONFIG_ROOT=\"/maliit/\" -DMALIIT_FRAMEWORK_USE_INTERNAL_API -DMALIIT_TEST_DATA_PATH=\"/usr/lib/maliit-framework-tests\" -DQT_NO_KEYWORDS -DQT_TESTLIB_LIB -DQT_GUI_LIB -DQT_CORE_LIB -DQT_SHARED -I/usr/lib/qt4/mkspecs/linux-g++ -I. -I/usr/include/QtCore -I/usr/include/QtGui -I/usr/include/QtTest -I/usr/include -I. -I../.. -I../../src -I../../common -I../../connection -I../utils -I/usr/X11R6/include -I.moc -o .obj/ut_maliit_inputmethod.o ut_maliit_inputmethod.cpp In file included from /usr/include/QtCore/QString:1:0,

                from ../utils/core-utils.h:20,
                from ../utils/core-utils.cpp:17:

/usr/include/QtCore/qstring.h:174:17: note: the mangling of 'va_list' has changed in GCC 4.4 In file included from ut_maliit_inputmethod.cpp:24:0: ../utils/gui-utils.h: In instantiation of 'bool MaliitTestUtils::EventSpyInputContext<T>::filterEvent(const QEvent*) [with T = QEvent::Type]': .moc/ut_maliit_inputmethod.moc:127:1: required from here ../utils/gui-utils.h:59:13: error: 'push_back' was not declared in this scope, and no declarations were found by argument-dependent lookup at the point of instantiation [-fpermissive] ../utils/gui-utils.h:59:13: note: declarations in dependent base 'std::vector<QEvent::Type, std::allocator<QEvent::Type> >' are not found by unqualified lookup ../utils/gui-utils.h:59:13: note: use 'this->push_back' instead make[2]: Leaving directory `/builddir/build/BUILD/maliit-framework-0.91.0/tests/ut_maliit_inputmethod' make[2]: *** [.obj/ut_maliit_inputmethod.o] Error 1 make[1]: *** [sub-ut_maliit_inputmethod-make_default-ordered] Error 2 make[1]: Leaving directory `/builddir/build/BUILD/maliit-framework-0.91.0/tests' make: *** [sub-tests-make_default-ordered] Error 2 RPM build errors: error: Bad exit status from /var/tmp/rpm-tmp.UxSQgf (%build)

   Bad exit status from /var/tmp/rpm-tmp.UxSQgf (%build)

Child returncode was: 1 EXCEPTION: Command failed. See logs for output.

# ['bash', '--login', '-c', 'rpmbuild -bb --target armv5tel --nodeps builddir/build/SPECS/maliit-framework.spec']

Traceback (most recent call last):

 File "/usr/lib/python2.7/site-packages/mockbuild/trace_decorator.py", line 70, in trace
   result = func(*args, **kw)
 File "/usr/lib/python2.7/site-packages/mockbuild/util.py", line 352, in do
   raise mockbuild.exception.Error, ("Command failed. See logs for output.\n # %s" % (command,), child.returncode)

Error: Command failed. See logs for output.

# ['bash', '--login', '-c', 'rpmbuild -bb --target armv5tel --nodeps builddir/build/SPECS/maliit-framework.spec']

LEAVE do --> EXCEPTION RAISED

Return to "Design Team/Proposals/Touchscreen/On-screen Keyboard" page.